[Gtk-sharp-list] NEED URGENT HELP:Gnome-sharp 2.16.0 build fails

svalbard colaco svalbardcolaco at gmail.com
Sat Jul 26 00:56:32 EDT 2008

Hi all;

I could sucessfully build gtk-sharp-2.11.91 and was compiling
gnome-sharp-2.16.0 . what are the dependencies for *gnome-sharp*?
It configures properly but fails during make giving the following error.

Actually the art and gnomevfs folder build correctly

generated/App.cs(41,31): warning CS0108:
Gnome.App.Name<http://gnome.app.name/>hides inherited member
Gtk.Widget.Name <http://gtk.widget.name/> . Use the new keyword if hiding
was intended
(Location of the symbol related to previous warning)
generated/ThemeFile.cs(41,40): warning CS0809: Obsolete member
`Gnome.ThemeFile.ToString()' overrides non-obsolete member
CanvasPathDef.custom(24,51):* error *CS1502: The best overloaded method
match for `Gnome.CanvasPathDef.gnome_canvas_path_def_new_from_bpath(System.IntPtr)'
has some invalid arguments
generated/CanvasPathDef.cs(263,38): (Location of the symbol related to
previous error)
CanvasPathDef.custom(24,51):* error* CS1615: Argument `1' should not be
passed with the `ref' keyword
Compilation failed: 2 error(s), 2 warnings
make[3]: *** [gnome-sharp.dll] Error 1
make[3]: Leaving directory `/usr/x11_install/src/gnome-sharp-2.16.0/gnome'
make[2]: *** [all-recursive] Error 1
make[2]: Leaving directory `/usr/x11_install/src/gnome-sharp-2.16.0/gnome'
make[1]: *** [all-recursive] Error 1
make[1]: Leaving directory `/usr/x11_install/src/gnome-sharp-2.16.0'
make: *** [all] Error 2

Please any pointers in this regard will be og great help.

-------------- next part --------------
An HTML attachment was scrubbed...
URL: http://lists.ximian.com/pipermail/gtk-sharp-list/attachments/20080726/38bb07ee/attachment.html 

More information about the Gtk-sharp-list mailing list