[Mono-list] Error Compiling Monodevelop 0.5.1

David P. Donahue ddonahue@ccs.neu.edu
Sun, 24 Apr 2005 21:09:21 -0400

Just tried compiling Monodevelop 0.5.1 on Slackware 10.0 and got the 
following (sorry for any wrapping):

././FileBrowser/FileBrowser.cs(31) error CS1527: Namespace elements 
cannot be explicitly declared as private, protected or protected internal
Compilation failed: 1 error(s), 0 warnings
make[3]: *** [MonoDevelop.Gui.Widgets.dll] Error 1
make[3]: Leaving directory 
make[2]: *** [all-recursive] Error 1
make[2]: Leaving directory `/usr/src/monodevelop-0.5.1/src/Libraries'
make[1]: *** [all-recursive] Error 1
make[1]: Leaving directory `/usr/src/monodevelop-0.5.1/src'
make: *** [all-recursive] Error 1

Something I did?  Something I can fix?  Any advice would be much 
appreciated, thanks.

David P. Donahue