[Mono-dev] Unable to compile mono-debugger-2.6 preview 1

Paul paul at all-the-johnsons.co.uk
Sun Oct 4 11:12:46 EDT 2009


I'm getting this when I try to compile 2.6 preview 1 mono-debugger

-out:debugger-test-server.exe ../test/framework/DebuggerTestServer.cs
-r:Mono.Debugger.Test.Framework.dll -r:System.Runtime.Remoting
-r:nunit.framework -r:nunit.core -r:nunit.core.interfaces -r:nunit.util
-debug -define:DEBUG -define:DEBUGGER_SOURCE -nowarn:0169,0067   -d:LINQ
error CS0006: cannot find metadata file
Compilation failed: 1 error(s), 0 warnings
make[2]: *** [debugger-test-server.exe] Error 1
make[2]: Leaving directory
make[1]: *** [all-recursive] Error 1
make[1]: Leaving directory `/home/paul/rpmbuild/BUILD/mono-debugger-2.6'
make: *** [all] Error 2
error: Bad exit status from /var/tmp/rpm-tmp.McBj6f (%build)

Any ideas?



Sie können mich aufreizen und wirklich heiß machen!
-------------- next part --------------
A non-text attachment was scrubbed...
Name: not available
Type: application/pgp-signature
Size: 198 bytes
Desc: This is a digitally signed message part
Url : http://lists.ximian.com/pipermail/mono-devel-list/attachments/20091004/b9acd295/attachment.bin 

More information about the Mono-devel-list mailing list