[Mono-devel-list] Ignored Testcases - 20041027

Ritvik Mayank mritvik at novell.com
Wed Oct 27 09:48:21 EDT 2004

Hi , 

Today tests were not performed for the following::


when i do a "make PROFILE=default test"

the test terminates with the following error:: 

Generating proxies
Soap proxy for ./wsdlcache/upload.eraserver.net/autoloanTest.wsdl...
Unhandled Exception: System.ComponentModel.Win32Exception: Cannot find
the specified file
in <0x006dd> System.Diagnostics.Process:Start_common
in <0x00019> System.Diagnostics.Process:Start ()
in <0x00058> (wrapper remoting-invoke-with-check)
System.Diagnostics.Process:Start ()
in <0x003df> Driver:BuildProxy
in <0x001ea> Driver:BuildProxies (string)
in <0x000cd> Driver:Main (string[])

make: *** [test-wsdl] Error 1

TestFixture under TestBitmap were ignored   (as quite a few tests were
hanging )

best regards,

More information about the Mono-devel-list mailing list