[Mono-devel-list] Error while building mono

Sachin Kumar skumar1 at novell.com
Wed May 19 07:28:07 EDT 2004


I get following error when i try to build mono.

make[3]: Entering directory `/tmp/snapshot/20040519/mcs/errors'
mcs /target:library /out:CS0618-2-lib.dll CS0618-2-lib.cs
CS0618-2-lib.cs(3) error CS0592: Attribute 'System.Obsolete' is not
valid on this declaration type. It is valid on 'class' 'constructor'
'delegate' 'enum' 'event' 'field' 'interface' 'method' 'property'
'struct' declarations only.
Compilation failed: 1 error(s), 0 warnings
make[3]: *** [CS0618-2-lib.dll] Error 1
make[3]: Leaving directory `/tmp/snapshot/20040519/mcs/errors'
make[2]: *** [all-recursive] Error 1
make[2]: Leaving directory `/tmp/snapshot/20040519/mcs'
make[1]: *** [all-profiles] Error 1
make[1]: Leaving directory `/tmp/snapshot/20040519/mcs'
make: *** [stage3] Error 2

Any ideas ?


More information about the Mono-devel-list mailing list