[Mono-devel-list] make run-test in mcs fails

Nick Drochak ndrochak at gol.com
Wed May 12 10:51:53 EDT 2004


And finally, make run-test fails now in mcs:

make[2]: Entering directory `/home/Administrator/mcs/class/corlib'
../../class/lib/nunit-console.exe corlib_plattest.dll

Unhandled Exception: System.IO.FileLoadException: The located assembly's
manifest definition with name 'NUnit.Util' does
 not match the assembly reference.
File name: "NUnit.Util"
   at NUnit.Console.ConsoleUi.Main(String[] args)

=== Pre-bind state information ===
LOG: DisplayName = NUnit.Util, Version=, Culture=neutral,
LOG: Appbase = C:\cygwin\home\Administrator\mcs\class\lib\
LOG: Initial PrivatePath = NULL
Calling assembly : nunit-console, Version=1.0.5000.0, Culture=neutral,

LOG: Application configuration file does not exist.
LOG: Publisher policy file is not found.
LOG: Host configuration file not found.
LOG: Using machine configuration file from
LOG: Post-policy reference: NUnit.Util, Version=, Culture=neutral,
LOG: Attempting download of new URL
WRN: Comparing the assembly name resulted in the mismatch: Major Version

make[2]: *** [run-plattest] Unknown signal 79
make[2]: Leaving directory `/home/Administrator/mcs/class/corlib'
make[1]: *** [run-test-recursive] Error 1
make[1]: Leaving directory `/home/Administrator/mcs/class'
make: *** [run-test-recursive] Error 1

Nick D.

P.S.  Gonzalo said he might have time to look into this today after he wakes
up.  Thanks Gonz!

More information about the Mono-devel-list mailing list