[Mono-bugs] [Bug 587491] Mono 2.6.1 crash on 10.5/ppc during compile

bugzilla_noreply at novell.com bugzilla_noreply at novell.com
Mon Apr 26 21:20:51 EDT 2010



--- Comment #4 from Benjamin Reed <ranger at befunk.com> 2010-04-27 01:20:49 UTC ---
Dang, I was hoping bug #440924 might have been related to this, but no luck. 
Still seeing the failure on 10.5/ppc.  Passes on 10.4/ppc, 10.5/i386, and
10.6/i386, it's only 10.5/ppc that's bombing.  :(

make profile-do--net_1_1--all profile-do--net_2_0--all profile-do--net_3_5--all
make PROFILE=basic all
mkdir -p -- build/deps
make[6]: mcs: Command not found
make[6]: *** [build/deps/basic-profile-check.exe] Error 127
*** The compiler 'mcs' doesn't appear to be usable.
*** Trying the 'monolite' directory.
ERROR:mini-ppc.c:2903:ppc_patch_full: code should not be reached

  at Mono.CSharp.Location..ctor (int) <0xffffffff>
  at Mono.CSharp.Location..ctor (int) <0x00030>
  at Mono.CSharp.Location..cctor () <0x0002c>
  at (wrapper runtime-invoke) object.runtime_invoke_void
(object,intptr,intptr,intptr) <0xffffffff>
  at Mono.CSharp.Driver.Main (string[]) <0xffffffff>
  at Mono.CSharp.Driver.Main (string[]) <0x00058>
  at (wrapper runtime-invoke) <Module>.runtime_invoke_int_object
(object,intptr,intptr,intptr) <0xffffffff>

Native stacktrace:

        0   mono                                0x0007c6ec
mono_handle_native_sigsegv + 300
        1   libSystem.B.dylib                   0x953d59fc _sigtramp + 68
ERROR:mini-darwin.c:245:mono_runtime_syscall_fork: code should not be reached
make[8]: *** [build/deps/basic-profile-check.exe] Abort trap
*** The contents of your 'monolite' directory may be out-of-date
*** You may want to try 'make get-monolite-latest'
make[8]: *** [do-profile-check-monolite] Error 1
make[7]: *** [do-profile-check] Error 2
make[6]: *** [do-profile-check-monolite] Error 2
make[5]: *** [do-profile-check] Error 2
make[4]: *** [profile-do--basic--all] Error 2
make[3]: *** [profiles-do--all] Error 2
make[2]: *** [all-local] Error 2
make[1]: *** [all-recursive] Error 1
make: *** [all] Error 2
### execution of /var/tmp/tmp.1.8i5PpZ failed, exit code 2
Removing runtime build-lock...
Removing build-lock package...
/sw/bin/dpkg-lockwait -r fink-buildlock-mono-2.6.4-1
(Reading database ... 46803 files and directories currently installed.)
Removing fink-buildlock-mono-2.6.4-1 ...
Failed: phase compiling: mono-2.6.4-1 failed

Configure bugmail: http://bugzilla.novell.com/userprefs.cgi?tab=email
------- You are receiving this mail because: -------
You are the QA contact for the bug.

More information about the mono-bugs mailing list