[Mono-bugs] [Bug 76875][Wis] New - Can't compile on AMD 64

bugzilla-daemon at bugzilla.ximian.com bugzilla-daemon at bugzilla.ximian.com
Thu Dec 1 21:42:35 EST 2005

Please do not reply to this email- if you want to comment on the bug, go to the
URL shown below and enter your comments there.

Changed by agillesp at vt.edu.


--- shadow/76875	2005-12-01 21:42:35.000000000 -0500
+++ shadow/76875.tmp.2251	2005-12-01 21:42:35.000000000 -0500
@@ -0,0 +1,33 @@
+Bug#: 76875
+Product: Mono: Debugger
+Version: 1.1
+OS Details: 
+Status: NEW   
+Priority: Wishlist
+Component: backend
+AssignedTo: toshok at ximian.com                            
+ReportedBy: agillesp at vt.edu               
+QAContact: mono-bugs at ximian.com
+TargetMilestone: ---
+Summary: Can't compile on AMD 64
+During make I get the following error:
+wrapper.c:41: error: ‘mono_generic_trampoline_code’ undeclared here (not in
+a function)
+wrapper.c:60: warning: initialization makes integer from pointer without a cast
+make[2]: *** [wrapper.o] Error 1
+make[2]: Leaving directory `/usr/local/src/mono/mono-debugger-0.10/wrapper'
+make[1]: *** [all-recursive] Error 1
+make[1]: Leaving directory `/usr/local/src/mono/mono-debugger-0.10'
+make: *** [all] Error 2
+I'm running on an AMD 64 Compaq Presario R3000 with Ubuntu 5.10.

More information about the mono-bugs mailing list